Target
Mucolipin-3
Ligand
BDBM46972
Substrate
Meas. Tech.
Dose response cell-based high-throughput screening assay for agonists of the transient receptor potential channel ML3 (TRPML3)
EC50
>29900±n/a nM
Citation
 PubChem, PC Dose response cell-based high-throughput screening assay for agonists of the transient receptor potential channel ML3 (TRPML3) PubChem Bioassay (2009)[AID] 
Target
Name:
Mucolipin-3
Synonyms:
MCLN3_HUMAN MCOLN3 protein
Type:
Enzyme Catalytic Domain
Mol. Mass.:
64244.09
Organism:
Homo sapiens (Human)
Description:
Q8TDD5
Residue:
553
  
Inhibitor
Name:
BDBM46972
Synonyms:
MLS000775212 N-[4-(diethylamino)phenyl]-2-[4-[methyl(thiophen-2-ylsulfonyl)amino]phenoxy]acetamide SMR000364966 | cid_2345854
Type:
Small organic molecule
Emp. Form.:
C23H27N3O4S2
Mol. Mass.:
473.608
SMILES:
CCN(CC)c1ccc(NC(=O)COc2ccc(cc2)N(C)S(=O)(=O)c2cccs2)cc1
: