Target
Procathepsin L
Ligand
BDBM34189
Substrate
Meas. Tech.
Cathepsin L dose-response testing in the presence of cysteine
IC50
2157.21±472.026535 nM
Citation
 PubChem, PC Cathepsin L dose-response testing in the presence of cysteine PubChem Bioassay (2009)[AID] 
Target
Name:
Procathepsin L
Synonyms:
CATL1_HUMAN CTSL CTSL1 Cathepsin L Cathepsin L1 heavy chain MEP cathepsin L preproprotein
Type:
Enzyme
Mol. Mass.:
37557.19
Organism:
Homo sapiens (Human)
Description:
Purchased from Calbiochem (San Diego, CA).
Residue:
333
  
Inhibitor
Name:
BDBM34189
Synonyms:
MLS000119701 N-[4-[(4-methylpiperidin-1-yl)methyl]phenyl]-1-(5-pyrrol-1-yl-1,3,4-thiadiazol-2-yl)piperidine-4-carboxamide SMR000096622 | cid_5309189
Type:
Small organic molecule
Emp. Form.:
C25H32N6OS
Mol. Mass.:
464.626
SMILES:
CC1CCN(Cc2ccc(NC(=O)C3CCN(CC3)c3nnc(s3)-n3cccc3)cc2)CC1
: