Target
Procathepsin L
Ligand
BDBM35524
Substrate
Meas. Tech.
Cathepsin L dose-response testing in the presence of cysteine
IC50
30620.36±4994.70492 nM
Citation
 PubChem, PC Cathepsin L dose-response testing in the presence of cysteine PubChem Bioassay (2009)[AID] 
Target
Name:
Procathepsin L
Synonyms:
CATL1_HUMAN CTSL CTSL1 Cathepsin L Cathepsin L1 heavy chain MEP cathepsin L preproprotein
Type:
Enzyme
Mol. Mass.:
37557.19
Organism:
Homo sapiens (Human)
Description:
Purchased from Calbiochem (San Diego, CA).
Residue:
333
  
Inhibitor
Name:
BDBM35524
Synonyms:
4-[1-(2-ethenoxyethyl)-2-benzimidazolyl]-1,2,5-oxadiazol-3-amine MLS000109692 [4-[1-(2-vinyloxyethyl)benzimidazol-2-yl]furazan-3-yl]amine | cid_2883004
Type:
Small organic molecule
Emp. Form.:
C13H13N5O2
Mol. Mass.:
271.2746
SMILES:
Nc1nonc1-c1nc2ccccc2n1CCOC=C
: