Target
Transitional endoplasmic reticulum ATPase
Ligand
BDBM47013
Substrate
Meas. Tech.
Luminescence counterscreen assay for p97 inhibitors: dose response biochemical high throughput screening assay to identify inhibitors of the C522A mutant p97 ATPase: synthesized compounds.
IC50
>50000±n/a nM
Citation
 PubChem, PC Luminescence counterscreen assay for p97 inhibitors: dose response biochemical high throughput screening assay to identify inhibitors of the C522A mutant p97 ATPase: synthesized compounds. PubChem Bioassay (2009)[AID] 
Target
Name:
Transitional endoplasmic reticulum ATPase
Synonyms:
TERA_HUMAN VCP Valosin-containing protein
Type:
Enzyme
Mol. Mass.:
89300.63
Organism:
Homo sapiens (Human)
Description:
P55072
Residue:
806
  
Inhibitor
Name:
BDBM47013
Synonyms:
(E)-3-(9-anthracenyl)-2-cyano-2-propenoic acid ethyl ester SR-03000000238-1 ethyl (E)-3-anthracen-9-yl-2-cyano-prop-2-enoate | ethyl (E)-3-anthracen-9-yl-2-cyanoprop-2-enoate
Type:
Small organic molecule
Emp. Form.:
C20H15NO2
Mol. Mass.:
301.3386
SMILES:
CCOC(=O)C(=C\c1c2ccccc2cc2ccccc12)\C#N
: