Target
Protein-tyrosine kinase 2-beta
Ligand
BDBM40031
Substrate
Meas. Tech.
TR-FRET counterscreen for FAK inhibitors: dose-response biochemical high throughput screening assay to identify inhibitors of Proline-rich tyrosine kinase 2 (Pyk2)
IC50
1898±n/a nM
Citation
 PubChem, PC TR-FRET counterscreen for FAK inhibitors: dose-response biochemical high throughput screening assay to identify inhibitors of Proline-rich tyrosine kinase 2 (Pyk2) PubChem Bioassay (2009)[AID] 
Target
Name:
Protein-tyrosine kinase 2-beta
Synonyms:
FAK2 PTK2B PTK2B protein tyrosine kinase 2 beta (PTK2B) Protein tyrosine kinase 2 beta | RAFTK
Type:
Protein
Mol. Mass.:
115868.80
Organism:
Homo sapiens (Human)
Description:
Q14289
Residue:
1009
  
Inhibitor
Name:
BDBM40031
Synonyms:
MLS000095690 N-[4-[5-(2-furyl)triazol-1-yl]phenyl]-2-keto-chromene-3-carboxamide N-[4-[5-(furan-2-yl)triazol-1-yl]phenyl]-2-oxochromene-3-carboxamide SMR000031236 | cid_3241109
Type:
Small organic molecule
Emp. Form.:
C22H14N4O4
Mol. Mass.:
398.371
SMILES:
O=C(Nc1ccc(cc1)-n1nncc1-c1ccco1)c1cc2ccccc2oc1=O
: