Target
Protein-tyrosine kinase 2-beta
Ligand
BDBM40989
Substrate
Meas. Tech.
TR-FRET counterscreen for FAK inhibitors: dose-response biochemical high throughput screening assay to identify inhibitors of Proline-rich tyrosine kinase 2 (Pyk2)
IC50
>69500±n/a nM
Citation
 PubChem, PC TR-FRET counterscreen for FAK inhibitors: dose-response biochemical high throughput screening assay to identify inhibitors of Proline-rich tyrosine kinase 2 (Pyk2) PubChem Bioassay (2009)[AID] 
Target
Name:
Protein-tyrosine kinase 2-beta
Synonyms:
FAK2 PTK2B PTK2B protein tyrosine kinase 2 beta (PTK2B) Protein tyrosine kinase 2 beta | RAFTK
Type:
Protein
Mol. Mass.:
115868.80
Organism:
Homo sapiens (Human)
Description:
Q14289
Residue:
1009
  
Inhibitor
Name:
BDBM40989
Synonyms:
2-methyl-5-oxo-7-thiophen-2-yl-4-(3-thiophenyl)-4,6,7,8-tetrahydro-1H-quinoline-3-carboxylic acid methyl ester MLS000111666 cid_2894685 methyl 2-methyl-5-oxo-7-thiophen-2-yl-4-thiophen-3-yl-4,6,7,8-tetrahydro-1H-quinoline-3-carboxylate
Type:
Small organic molecule
Emp. Form.:
C20H19NO3S2
Mol. Mass.:
385.5
SMILES:
COC(=O)C1C(c2ccsc2)C2=C(CC(CC2=O)c2cccs2)N=C1C
: