Target
Protein-tyrosine kinase 2-beta
Ligand
BDBM41013
Substrate
Meas. Tech.
TR-FRET counterscreen for FAK inhibitors: dose-response biochemical high throughput screening assay to identify inhibitors of Proline-rich tyrosine kinase 2 (Pyk2)
IC50
1449±n/a nM
Citation
 PubChem, PC TR-FRET counterscreen for FAK inhibitors: dose-response biochemical high throughput screening assay to identify inhibitors of Proline-rich tyrosine kinase 2 (Pyk2) PubChem Bioassay (2009)[AID] 
Target
Name:
Protein-tyrosine kinase 2-beta
Synonyms:
FAK2 PTK2B PTK2B protein tyrosine kinase 2 beta (PTK2B) Protein tyrosine kinase 2 beta | RAFTK
Type:
Protein
Mol. Mass.:
115868.80
Organism:
Homo sapiens (Human)
Description:
Q14289
Residue:
1009
  
Inhibitor
Name:
BDBM41013
Synonyms:
4-methoxy-N-(7-methyl-2-thiazolo[4,5-g][1,3]benzothiazolyl)benzamide 4-methoxy-N-(7-methylthiazolo[4,5-g][1,3]benzothiazol-2-yl)benzamide SMR000126767 | cid_4582891
Type:
Small organic molecule
Emp. Form.:
C17H13N3O2S2
Mol. Mass.:
355.434
SMILES:
COc1ccc(cc1)C(=O)Nc1nc2ccc3nc(C)sc3c2s1
: