Target
Protein-tyrosine kinase 2-beta
Ligand
BDBM41059
Substrate
Meas. Tech.
TR-FRET counterscreen for FAK inhibitors: dose-response biochemical high throughput screening assay to identify inhibitors of Proline-rich tyrosine kinase 2 (Pyk2)
IC50
3765±n/a nM
Citation
 PubChem, PC TR-FRET counterscreen for FAK inhibitors: dose-response biochemical high throughput screening assay to identify inhibitors of Proline-rich tyrosine kinase 2 (Pyk2) PubChem Bioassay (2009)[AID] 
Target
Name:
Protein-tyrosine kinase 2-beta
Synonyms:
FAK2 PTK2B PTK2B protein tyrosine kinase 2 beta (PTK2B) Protein tyrosine kinase 2 beta | RAFTK
Type:
Protein
Mol. Mass.:
115868.80
Organism:
Homo sapiens (Human)
Description:
Q14289
Residue:
1009
  
Inhibitor
Name:
BDBM41059
Synonyms:
(5E)-5-[3-ethoxy-4-(4-nitrobenzyl)oxy-benzylidene]-2-thioxo-4-imidazolidinone (5E)-5-[[3-ethoxy-4-[(4-nitrophenyl)methoxy]phenyl]methylidene]-2-sulfanylidene-imidazolidin-4-one 5-[3-ethoxy-4-({4-nitrobenzyl}oxy)benzylidene]-2-thioxo-4-imidazolidinone SMR000159567 | cid_1224698
Type:
Small organic molecule
Emp. Form.:
C19H17N3O5S
Mol. Mass.:
399.42
SMILES:
CCOc1cc(\C=C2\NC(=S)NC2=O)ccc1OCc1ccc(cc1)[N+]([O-])=O
: