Target
Phosphomannomutase 2
Ligand
BDBM46659
Substrate
Meas. Tech.
Counter screen SAR assay for PMM2 inhibitors via a fluorescence intensity assay
IC50
>100000±n/a nM
Citation
 PubChem, PC Counter screen SAR assay for PMM2 inhibitors via a fluorescence intensity assay PubChem Bioassay (2010)[AID] 
Target
Name:
Phosphomannomutase 2
Synonyms:
PMM2 | PMM2_HUMAN
Type:
Enzyme Catalytic Domain
Mol. Mass.:
28082.33
Organism:
Homo sapiens (Human)
Description:
gi_4557839
Residue:
246
  
Inhibitor
Name:
BDBM46659
Synonyms:
2-(5-bromanyl-1,3-thiazol-2-yl)-1,2-benzothiazol-3-one 2-(5-bromo-2-thiazolyl)-1,2-benzothiazol-3-one MLS-0315811.0001 | cid_2327944
Type:
Small organic molecule
Emp. Form.:
C10H5BrN2OS2
Mol. Mass.:
313.194
SMILES:
Brc1cnc(s1)-n1sc2ccccc2c1=O
: