Target
Phosphomannomutase 2
Ligand
BDBM46684
Substrate
Meas. Tech.
Counter screen SAR assay for PMM2 inhibitors via a fluorescence intensity assay
IC50
>100000±n/a nM
Citation
 PubChem, PC Counter screen SAR assay for PMM2 inhibitors via a fluorescence intensity assay PubChem Bioassay (2010)[AID] 
Target
Name:
Phosphomannomutase 2
Synonyms:
PMM2 | PMM2_HUMAN
Type:
Enzyme Catalytic Domain
Mol. Mass.:
28082.33
Organism:
Homo sapiens (Human)
Description:
gi_4557839
Residue:
246
  
Inhibitor
Name:
BDBM46684
Synonyms:
(4-chlorodithiazol-5-ylidene)-(4-methyl-3-nitro-phenyl)amine 4-chloro-N-(4-methyl-3-nitrophenyl)-5-dithiazolimine MLS-0390831.0001 | cid_715708
Type:
Small organic molecule
Emp. Form.:
C9H6ClN3O2S2
Mol. Mass.:
287.746
SMILES:
Cc1ccc(cc1[N+]([O-])=O)\N=c1\ssnc1Cl
: