Target
Phosphomannomutase 2
Ligand
BDBM46704
Substrate
Meas. Tech.
Counter screen SAR assay for PMM2 inhibitors via a fluorescence intensity assay
IC50
>100000±n/a nM
Citation
 PubChem, PC Counter screen SAR assay for PMM2 inhibitors via a fluorescence intensity assay PubChem Bioassay (2010)[AID] 
Target
Name:
Phosphomannomutase 2
Synonyms:
PMM2 | PMM2_HUMAN
Type:
Enzyme Catalytic Domain
Mol. Mass.:
28082.33
Organism:
Homo sapiens (Human)
Description:
gi_4557839
Residue:
246
  
Inhibitor
Name:
BDBM46704
Synonyms:
4-[(4-chloranyl-3H-1,2,3-dithiazol-5-yl)imino]cyclohexa-2,5-dien-1-one 4-[(4-chloro-3H-dithiazol-5-yl)imino]cyclohexa-2,5-dien-1-one cid_22765927
Type:
Small organic molecule
Emp. Form.:
C8H5ClN2OS2
Mol. Mass.:
244.721
SMILES:
Oc1ccc(cc1)N=c1ssnc1Cl
: