Target
Phosphomannomutase 2
Ligand
BDBM46713
Substrate
Meas. Tech.
Counter screen SAR assay for PMM2 inhibitors via a fluorescence intensity assay
IC50
>65800±n/a nM
Citation
 PubChem, PC Counter screen SAR assay for PMM2 inhibitors via a fluorescence intensity assay PubChem Bioassay (2010)[AID] 
Target
Name:
Phosphomannomutase 2
Synonyms:
PMM2 | PMM2_HUMAN
Type:
Enzyme Catalytic Domain
Mol. Mass.:
28082.33
Organism:
Homo sapiens (Human)
Description:
gi_4557839
Residue:
246
  
Inhibitor
Name:
BDBM46713
Synonyms:
(4-chlorodithiazol-5-ylidene)-(3-pyridyl)amine 4-chloro-N-(3-pyridinyl)-5-dithiazolimine MLS-0390903.0001 | cid_25181221
Type:
Small organic molecule
Emp. Form.:
C7H4ClN3S2
Mol. Mass.:
229.71
SMILES:
Clc1nss\c1=N/c1cccnc1
: