Target
Phosphoethanolamine/phosphocholine phosphatase
Ligand
BDBM46624
Substrate
Meas. Tech.
SAR assay for compounds that inhibit PHOSPHO1
IC50
384.5±n/a nM
Citation
 PubChem, PC SAR assay for compounds that inhibit PHOSPHO1 PubChem Bioassay (2010)[AID] 
Target
Name:
Phosphoethanolamine/phosphocholine phosphatase
Synonyms:
PHOP1_HUMAN phosphatase, orphan 1
Type:
Enzyme Catalytic Domain
Mol. Mass.:
29718.09
Organism:
Homo sapiens (Human)
Description:
Q8TCT1
Residue:
267
  
Inhibitor
Name:
BDBM46624
Synonyms:
2-(2,5-dichlorophenyl)-6-fluoro-1,2-benzothiazol-3-one MLS-0315776.0001 | cid_1510384
Type:
Small organic molecule
Emp. Form.:
C13H6Cl2FNOS
Mol. Mass.:
314.162
SMILES:
Fc1ccc2c(c1)sn(-c1cc(Cl)ccc1Cl)c2=O
: