Target
Phosphoethanolamine/phosphocholine phosphatase
Ligand
BDBM46631
Substrate
Meas. Tech.
SAR assay for compounds that inhibit PHOSPHO1
IC50
34.8±n/a nM
Citation
 PubChem, PC SAR assay for compounds that inhibit PHOSPHO1 PubChem Bioassay (2010)[AID] 
Target
Name:
Phosphoethanolamine/phosphocholine phosphatase
Synonyms:
PHOP1_HUMAN phosphatase, orphan 1
Type:
Enzyme Catalytic Domain
Mol. Mass.:
29718.09
Organism:
Homo sapiens (Human)
Description:
Q8TCT1
Residue:
267
  
Inhibitor
Name:
BDBM46631
Synonyms:
2-(3-fluorophenyl)-4,6-dinitro-1,2-benzothiazol-3-one cid_4917292
Type:
Small organic molecule
Emp. Form.:
C13H6FN3O5S
Mol. Mass.:
335.267
SMILES:
[O-][N+](=O)c1cc([N+]([O-])=O)c2c(c1)sn(-c1cccc(F)c1)c2=O
: