Target
Solute carrier family 12 member 5
Ligand
BDBM44178
Substrate
Meas. Tech.
Identification of Novel Modulators of Cl- dependent Transport Process via HTS; Dose-dependent Assay with KCC2
EC50
3280±n/a nM
Citation
 PubChem, PC Identification of Novel Modulators of Cl- dependent Transport Process via HTS; Dose-dependent Assay with KCC2 PubChem Bioassay (2009)[AID] 
Target
Name:
Solute carrier family 12 member 5
Synonyms:
Electroneutral potassium-chloride cotransporter 2 KCC2 Neuronal K-Cl cotransporter SLC12A5 electroneutral potassium-chloride cotransporter KCC2 | hKCC2
Type:
PROTEIN
Mol. Mass.:
126185.18
Organism:
Homo sapiens (Human)
Description:
ChEMBL_828024
Residue:
1139
  
Inhibitor
Name:
BDBM44178
Synonyms:
1-[1-(1-Benzo[1,3]dioxol-5-ylmethyl-1H-tetrazol-5-ylmethyl)-piperidin-4-yl]-2-methyl-5-trifluoromethyl-1H-benzoimidazole 1-[1-[[1-(1,3-benzodioxol-5-ylmethyl)-5-tetrazolyl]methyl]-4-piperidinyl]-2-methyl-5-(trifluoromethyl)benzimidazole 2-methyl-1-[1-[(1-piperonyltetrazol-5-yl)methyl]-4-piperidyl]-5-(trifluoromethyl)benzimidazole SMR000006459 | cid_650119
Type:
Small organic molecule
Emp. Form.:
C24H24F3N7O2
Mol. Mass.:
499.4883
SMILES:
Cc1nc2cc(ccc2n1C1CCN(Cc2nnnn2Cc2ccc3OCOc3c2)CC1)C(F)(F)F
: