Target
Glutathione S-transferase Mu 1
Ligand
BDBM47564
Substrate
Meas. Tech.
Profiling Assay to determine GST-GSH interactions in multiplex bead-based assays
EC50
74.47±n/a nM
Citation
 PubChem, PC Profiling Assay to determine GST-GSH interactions in multiplex bead-based assays PubChem Bioassay (2010)[AID] 
Target
Name:
Glutathione S-transferase Mu 1
Synonyms:
GST class-mu 1 GSTM1 GSTM1_HUMAN GSTM1b-1b Glutathione S-transferase Mu 1 glutathione S-transferase
Type:
PROTEIN
Mol. Mass.:
25712.03
Organism:
Homo sapiens (Human)
Description:
ChEMBL_799596
Residue:
218
  
Inhibitor
Name:
BDBM47564
Synonyms:
(E)-2-(4-bromophenyl)-3-(2,5-dimethoxy-4-pyrrolidin-1-yl-phenyl)prop-2-enenitrile (E)-2-(4-bromophenyl)-3-(2,5-dimethoxy-4-pyrrolidino-phenyl)acrylonitrile 2-(4-bromophenyl)-3-[2,5-dimethoxy-4-(1-pyrrolidinyl)phenyl]acrylonitrile SMR000143232 | cid_2192212
Type:
Small organic molecule
Emp. Form.:
C21H21BrN2O2
Mol. Mass.:
413.308
SMILES:
COc1cc(N2CCCC2)c(OC)cc1\C=C(\C#N)c1ccc(Br)cc1
: