Target
Glutathione S-transferase Mu 1
Ligand
BDBM32316
Substrate
Meas. Tech.
Profiling Assay to determine GST-GSH interactions in multiplex bead-based assays
EC50
400.1±n/a nM
Citation
 PubChem, PC Profiling Assay to determine GST-GSH interactions in multiplex bead-based assays PubChem Bioassay (2010)[AID] 
Target
Name:
Glutathione S-transferase Mu 1
Synonyms:
GST class-mu 1 GSTM1 GSTM1_HUMAN GSTM1b-1b Glutathione S-transferase Mu 1 glutathione S-transferase
Type:
PROTEIN
Mol. Mass.:
25712.03
Organism:
Homo sapiens (Human)
Description:
ChEMBL_799596
Residue:
218
  
Inhibitor
Name:
BDBM32316
Synonyms:
MLS000704595 cid_5774988 | ethyl 6-chloro-2,7-dioxo-2,7-dihydro-3H-naphtho[1,2,3-de]quinoline-1-carboxylate
Type:
Small organic molecule
Emp. Form.:
C19H12ClNO4
Mol. Mass.:
353.756
SMILES:
CCOC(=O)c1c2-c3ccccc3C(=O)c3c(Cl)ccc([nH]c1=O)c23
: