Target
Glutathione S-transferase Mu 1
Ligand
BDBM47634
Substrate
Meas. Tech.
Profiling Assay to determine GST-GSH interactions in multiplex bead-based assays
EC50
2035±n/a nM
Citation
 PubChem, PC Profiling Assay to determine GST-GSH interactions in multiplex bead-based assays PubChem Bioassay (2010)[AID] 
Target
Name:
Glutathione S-transferase Mu 1
Synonyms:
GST class-mu 1 GSTM1 GSTM1_HUMAN GSTM1b-1b Glutathione S-transferase Mu 1 glutathione S-transferase
Type:
PROTEIN
Mol. Mass.:
25712.03
Organism:
Homo sapiens (Human)
Description:
ChEMBL_799596
Residue:
218
  
Inhibitor
Name:
BDBM47634
Synonyms:
5-chloranylquinazolino[2,3-a]phthalazin-8-one 5-chloroquinazolino[2,3-a]phthalazin-8-one SMR000284122 | cid_722599
Type:
Small organic molecule
Emp. Form.:
C15H8ClN3O
Mol. Mass.:
281.697
SMILES:
Clc1nn2c(nc3ccccc3c2=O)c2ccccc12
: