Target
Glutathione S-transferase Mu 1
Ligand
BDBM32327
Substrate
Meas. Tech.
Profiling Assay to determine GST-GSH interactions in multiplex bead-based assays
EC50
11020±n/a nM
Citation
 PubChem, PC Profiling Assay to determine GST-GSH interactions in multiplex bead-based assays PubChem Bioassay (2010)[AID] 
Target
Name:
Glutathione S-transferase Mu 1
Synonyms:
GST class-mu 1 GSTM1 GSTM1_HUMAN GSTM1b-1b Glutathione S-transferase Mu 1 glutathione S-transferase
Type:
PROTEIN
Mol. Mass.:
25712.03
Organism:
Homo sapiens (Human)
Description:
ChEMBL_799596
Residue:
218
  
Inhibitor
Name:
BDBM32327
Synonyms:
4-amino-6,7-dimethoxy-3-(3-morpholin-4-ylpropyl)quinazoline-2-thione 4-amino-6,7-dimethoxy-3-[3-(4-morpholinyl)propyl]-2-quinazolinethione 4-imino-6,7-dimethoxy-3-(3-morpholinopropyl)-3,4-dihydro-2(1H)-quinazolinethione SMR000336049 | cid_1482788
Type:
Small organic molecule
Emp. Form.:
C17H24N4O3S
Mol. Mass.:
364.462
SMILES:
COc1cc2nc(=S)n(CCCN3CCOCC3)c(N)c2cc1OC
: