Target
Regulator of G-protein signaling 8
Ligand
BDBM47706
Substrate
Meas. Tech.
Dose respone, multiplexed high-throughput screen for small molecule regulators of RGS family protein interactions, specifically RGS8-Galphao.
EC50
>30000±n/a nM
Citation
 PubChem, PC Dose respone, multiplexed high-throughput screen for small molecule regulators of RGS family protein interactions, specifically RGS8-Galphao. PubChem Bioassay (2009)[AID] 
Target
Name:
Regulator of G-protein signaling 8
Synonyms:
RGS8 Regulator of G-protein signaling 8 (RGS8)
Type:
Enzyme Catalytic Domain
Mol. Mass.:
20925.80
Organism:
Homo sapiens (Human)
Description:
gi_74355113
Residue:
180
  
Inhibitor
Name:
BDBM47706
Synonyms:
2-[(4,5-dibenzyl-1,2,4-triazol-3-yl)sulfanyl]-N-(5-methyl-1,3,4-thiadiazol-2-yl)acetamide 2-[(4,5-dibenzyl-4H-1,2,4-triazol-3-yl)thio]-N-(5-methyl-1,3,4-thiadiazol-2-yl)acetamide 2-[[4,5-bis(phenylmethyl)-1,2,4-triazol-3-yl]thio]-N-(5-methyl-1,3,4-thiadiazol-2-yl)acetamide SMR000078897 | cid_1260067
Type:
Small organic molecule
Emp. Form.:
C21H20N6OS2
Mol. Mass.:
436.553
SMILES:
Cc1nnc(NC(=O)CSc2nnc(Cc3ccccc3)n2Cc2ccccc2)s1
: