Target
Regulator of G-protein signaling 8
Ligand
BDBM34435
Substrate
Meas. Tech.
Dose respone, multiplexed high-throughput screen for small molecule regulators of RGS family protein interactions, specifically RGS8-Galphao.
EC50
6700±n/a nM
Citation
 PubChem, PC Dose respone, multiplexed high-throughput screen for small molecule regulators of RGS family protein interactions, specifically RGS8-Galphao. PubChem Bioassay (2009)[AID] 
Target
Name:
Regulator of G-protein signaling 8
Synonyms:
RGS8 Regulator of G-protein signaling 8 (RGS8)
Type:
Enzyme Catalytic Domain
Mol. Mass.:
20925.80
Organism:
Homo sapiens (Human)
Description:
gi_74355113
Residue:
180
  
Inhibitor
Name:
BDBM34435
Synonyms:
4-cyano-3-methyl-5-[[1-oxo-2-[[5-(phenylmethyl)-1,3,4-oxadiazol-2-yl]thio]ethyl]amino]-2-thiophenecarboxylic acid ethyl ester MLS000051364 cid_2222655 ethyl 5-({[(5-benzyl-1,3,4-oxadiazol-2-yl)thio]acetyl}amino)-4-cyano-3-methyl-2-thiophenecarboxylate | ethyl 5-[[2-[(5-benzyl-1,3,4-oxadiazol-2-yl)sulfanyl]acetyl]amino]-4-cyano-3-methylthiophene-2-carboxylate
Type:
Small organic molecule
Emp. Form.:
C20H18N4O4S2
Mol. Mass.:
442.511
SMILES:
CCOC(=O)c1sc(NC(=O)CSc2nnc(Cc3ccccc3)o2)c(C#N)c1C
: