Target
Regulator of G-protein signaling 8
Ligand
BDBM47769
Substrate
Meas. Tech.
Dose respone, multiplexed high-throughput screen for small molecule regulators of RGS family protein interactions, specifically RGS8-Galphao.
EC50
>30000±n/a nM
Citation
 PubChem, PC Dose respone, multiplexed high-throughput screen for small molecule regulators of RGS family protein interactions, specifically RGS8-Galphao. PubChem Bioassay (2009)[AID] 
Target
Name:
Regulator of G-protein signaling 8
Synonyms:
RGS8 Regulator of G-protein signaling 8 (RGS8)
Type:
Enzyme Catalytic Domain
Mol. Mass.:
20925.80
Organism:
Homo sapiens (Human)
Description:
gi_74355113
Residue:
180
  
Inhibitor
Name:
BDBM47769
Synonyms:
2-[4-(2,6-dimethyl-4-morpholinyl)butoxy]benzoic acid methyl ester;oxalic acid MLS000680797 cid_2934198 methyl 2-[4-(2,6-dimethyl-4-morpholinyl)butoxy]benzoate oxalate | methyl 2-[4-(2,6-dimethylmorpholin-4-yl)butoxy]benzoate;oxalic acid
Type:
Small organic molecule
Emp. Form.:
C18H27NO4
Mol. Mass.:
321.4113
SMILES:
COC(=O)c1ccccc1OCCCCN1CC(C)OC(C)C1
: