Target
Regulator of G-protein signaling 8
Ligand
BDBM47780
Substrate
Meas. Tech.
Dose respone, multiplexed high-throughput screen for small molecule regulators of RGS family protein interactions, specifically RGS8-Galphao.
EC50
>30000±n/a nM
Citation
 PubChem, PC Dose respone, multiplexed high-throughput screen for small molecule regulators of RGS family protein interactions, specifically RGS8-Galphao. PubChem Bioassay (2009)[AID] 
Target
Name:
Regulator of G-protein signaling 8
Synonyms:
RGS8 Regulator of G-protein signaling 8 (RGS8)
Type:
Enzyme Catalytic Domain
Mol. Mass.:
20925.80
Organism:
Homo sapiens (Human)
Description:
gi_74355113
Residue:
180
  
Inhibitor
Name:
BDBM47780
Synonyms:
2-(3,5-dimethyl-N-methylsulfonylanilino)-N-[2-(phenylmethylthio)ethyl]acetamide MLS000713394 N-[2-(benzylthio)ethyl]-2-(N-mesyl-3,5-dimethyl-anilino)acetamide cid_2278591
Type:
Small organic molecule
Emp. Form.:
C20H26N2O3S2
Mol. Mass.:
406.562
SMILES:
Cc1cc(C)cc(c1)N(CC(=O)NCCSCc1ccccc1)S(C)(=O)=O
: