Target
Regulator of G-protein signaling 8
Ligand
BDBM47811
Substrate
Meas. Tech.
Dose respone, multiplexed high-throughput screen for small molecule regulators of RGS family protein interactions, specifically RGS8-Galphao.
EC50
>30000±n/a nM
Citation
 PubChem, PC Dose respone, multiplexed high-throughput screen for small molecule regulators of RGS family protein interactions, specifically RGS8-Galphao. PubChem Bioassay (2009)[AID] 
Target
Name:
Regulator of G-protein signaling 8
Synonyms:
RGS8 Regulator of G-protein signaling 8 (RGS8)
Type:
Enzyme Catalytic Domain
Mol. Mass.:
20925.80
Organism:
Homo sapiens (Human)
Description:
gi_74355113
Residue:
180
  
Inhibitor
Name:
BDBM47811
Synonyms:
7-amino-1,3-dimethyl-8H-pyrido[2,3-d]pyrimidine-2,4,5-trione MLS000775711 cid_389793
Type:
Small organic molecule
Emp. Form.:
C9H10N4O3
Mol. Mass.:
222.2007
SMILES:
Cn1c2nc(N)cc(O)c2c(=O)n(C)c1=O
: