Target
Regulator of G-protein signaling 8
Ligand
BDBM47815
Substrate
Meas. Tech.
Dose respone, multiplexed high-throughput screen for small molecule regulators of RGS family protein interactions, specifically RGS8-Galphao.
EC50
7260±n/a nM
Citation
 PubChem, PC Dose respone, multiplexed high-throughput screen for small molecule regulators of RGS family protein interactions, specifically RGS8-Galphao. PubChem Bioassay (2009)[AID] 
Target
Name:
Regulator of G-protein signaling 8
Synonyms:
RGS8 Regulator of G-protein signaling 8 (RGS8)
Type:
Enzyme Catalytic Domain
Mol. Mass.:
20925.80
Organism:
Homo sapiens (Human)
Description:
gi_74355113
Residue:
180
  
Inhibitor
Name:
BDBM47815
Synonyms:
2-(4-Methoxy-phenyl)-[1,4]benzoquinone 2-(4-methoxyphenyl)cyclohexa-2,5-diene-1,4-dione SMR000427749 | cid_121637
Type:
Small organic molecule
Emp. Form.:
C13H10O3
Mol. Mass.:
214.2167
SMILES:
COc1ccc(cc1)C1=CC(=O)C=CC1=O
: