Target
Regulator of G-protein signaling 7
Ligand
BDBM43363
Substrate
Meas. Tech.
Dose response, multiplexed high-throughput screen for small molecule regulators of RGS family protein interactions, specifically RGS7-Galphao.
EC50
830±n/a nM
Citation
 PubChem, PC Dose response, multiplexed high-throughput screen for small molecule regulators of RGS family protein interactions, specifically RGS7-Galphao. PubChem Bioassay (2009)[AID] 
Target
Name:
Regulator of G-protein signaling 7
Synonyms:
RGS7 | RGS7_HUMAN
Type:
Enzyme Catalytic Domain
Mol. Mass.:
57675.72
Organism:
Homo sapiens (Human)
Description:
P49802
Residue:
495
  
Inhibitor
Name:
BDBM43363
Synonyms:
2,5-bis(chloranyl)-3-piperidin-1-yl-6-(2-piperidin-1-yl-1,3-thiazol-5-yl)cyclohexa-2,5-diene-1,4-dione 2,5-dichloro-3-(1-piperidinyl)-6-[2-(1-piperidinyl)-5-thiazolyl]cyclohexa-2,5-diene-1,4-dione 2,5-dichloro-3-piperidino-6-(2-piperidinothiazol-5-yl)-p-benzoquinone SMR000115104 | cid_406171
Type:
Small organic molecule
Emp. Form.:
C19H21Cl2N3O2S
Mol. Mass.:
426.36
SMILES:
ClC1=C(N2CCCCC2)C(=O)C(Cl)=C(c2cnc(s2)N2CCCCC2)C1=O
: