Target
Regulator of G-protein signaling 7
Ligand
BDBM47739
Substrate
Meas. Tech.
Dose response, multiplexed high-throughput screen for small molecule regulators of RGS family protein interactions, specifically RGS7-Galphao.
EC50
>30000±n/a nM
Citation
 PubChem, PC Dose response, multiplexed high-throughput screen for small molecule regulators of RGS family protein interactions, specifically RGS7-Galphao. PubChem Bioassay (2009)[AID] 
Target
Name:
Regulator of G-protein signaling 7
Synonyms:
RGS7 | RGS7_HUMAN
Type:
Enzyme Catalytic Domain
Mol. Mass.:
57675.72
Organism:
Homo sapiens (Human)
Description:
P49802
Residue:
495
  
Inhibitor
Name:
BDBM47739
Synonyms:
MLS000586341 N-[1-(cyclohexylcarbamoyl)cyclohexyl]-N-(thiophen-2-ylmethyl)pyrazine-2-carboxamide N-{1-[(cyclohexylamino)carbonyl]cyclohexyl}-N-(thien-2-ylmethyl)pyrazine-2-carboxamide cid_4014737
Type:
Small organic molecule
Emp. Form.:
C23H30N4O2S
Mol. Mass.:
426.575
SMILES:
O=C(NC1CCCCC1)C1(CCCCC1)N(Cc1cccs1)C(=O)c1cnccn1
: