Target
Regulator of G-protein signaling 7
Ligand
BDBM47756
Substrate
Meas. Tech.
Dose response, multiplexed high-throughput screen for small molecule regulators of RGS family protein interactions, specifically RGS7-Galphao.
EC50
>30000±n/a nM
Citation
 PubChem, PC Dose response, multiplexed high-throughput screen for small molecule regulators of RGS family protein interactions, specifically RGS7-Galphao. PubChem Bioassay (2009)[AID] 
Target
Name:
Regulator of G-protein signaling 7
Synonyms:
RGS7 | RGS7_HUMAN
Type:
Enzyme Catalytic Domain
Mol. Mass.:
57675.72
Organism:
Homo sapiens (Human)
Description:
P49802
Residue:
495
  
Inhibitor
Name:
BDBM47756
Synonyms:
(4-chloro-6-methyl-pyrimidin-2-yl)amine 4-chloro-6-methyl-2-pyrimidinamine MLS000389365 cid_21810
Type:
Small organic molecule
Emp. Form.:
C5H6ClN3
Mol. Mass.:
143.574
SMILES:
Cc1cc(Cl)nc(N)n1
: