Target
Regulator of G-protein signaling 7
Ligand
BDBM47784
Substrate
Meas. Tech.
Dose response, multiplexed high-throughput screen for small molecule regulators of RGS family protein interactions, specifically RGS7-Galphao.
EC50
>30000±n/a nM
Citation
 PubChem, PC Dose response, multiplexed high-throughput screen for small molecule regulators of RGS family protein interactions, specifically RGS7-Galphao. PubChem Bioassay (2009)[AID] 
Target
Name:
Regulator of G-protein signaling 7
Synonyms:
RGS7 | RGS7_HUMAN
Type:
Enzyme Catalytic Domain
Mol. Mass.:
57675.72
Organism:
Homo sapiens (Human)
Description:
P49802
Residue:
495
  
Inhibitor
Name:
BDBM47784
Synonyms:
2-[[(2-acetamido-5-bromo-phenyl)-phenyl-methyl]amino]acetic acid methyl ester MLS000692775 cid_2870391 methyl 2-[[(2-acetamido-5-bromophenyl)-phenylmethyl]amino]acetate
Type:
Small organic molecule
Emp. Form.:
C18H19BrN2O3
Mol. Mass.:
391.259
SMILES:
COC(=O)CNC(c1ccccc1)c1cc(Br)ccc1NC(C)=O
: