Target
Regulator of G-protein signaling 7
Ligand
BDBM47794
Substrate
Meas. Tech.
Dose response, multiplexed high-throughput screen for small molecule regulators of RGS family protein interactions, specifically RGS7-Galphao.
EC50
>30000±n/a nM
Citation
 PubChem, PC Dose response, multiplexed high-throughput screen for small molecule regulators of RGS family protein interactions, specifically RGS7-Galphao. PubChem Bioassay (2009)[AID] 
Target
Name:
Regulator of G-protein signaling 7
Synonyms:
RGS7 | RGS7_HUMAN
Type:
Enzyme Catalytic Domain
Mol. Mass.:
57675.72
Organism:
Homo sapiens (Human)
Description:
P49802
Residue:
495
  
Inhibitor
Name:
BDBM47794
Synonyms:
MLS000419420 N-(5-chloro-4-methyl-1,3-benzothiazol-2-yl)acetamide cid_2150683
Type:
Small organic molecule
Emp. Form.:
C10H9ClN2OS
Mol. Mass.:
240.709
SMILES:
CC(=O)Nc1nc2c(C)c(Cl)ccc2s1
: