Target
Regulator of G-protein signaling 7
Ligand
BDBM47824
Substrate
Meas. Tech.
Dose response, multiplexed high-throughput screen for small molecule regulators of RGS family protein interactions, specifically RGS7-Galphao.
EC50
>30000±n/a nM
Citation
 PubChem, PC Dose response, multiplexed high-throughput screen for small molecule regulators of RGS family protein interactions, specifically RGS7-Galphao. PubChem Bioassay (2009)[AID] 
Target
Name:
Regulator of G-protein signaling 7
Synonyms:
RGS7 | RGS7_HUMAN
Type:
Enzyme Catalytic Domain
Mol. Mass.:
57675.72
Organism:
Homo sapiens (Human)
Description:
P49802
Residue:
495
  
Inhibitor
Name:
BDBM47824
Synonyms:
(E)-3-(2-furanyl)-N-[(4-sulfamoylphenyl)methyl]-2-propenamide (E)-3-(furan-2-yl)-N-[(4-sulfamoylphenyl)methyl]prop-2-enamide SMR000365355 | cid_2551912
Type:
Small organic molecule
Emp. Form.:
C14H14N2O4S
Mol. Mass.:
306.337
SMILES:
NS(=O)(=O)c1ccc(CNC(=O)\C=C\c2ccco2)cc1
: