Target
Regulator of G-protein signaling 19
Ligand
BDBM47699
Substrate
Meas. Tech.
Dose response, multiplexed high-throughput screen for small molecule regulators of RGS family protein interactions, specifically RGS19-Galphao.
EC50
>30000±n/a nM
Citation
 PubChem, PC Dose response, multiplexed high-throughput screen for small molecule regulators of RGS family protein interactions, specifically RGS19-Galphao. PubChem Bioassay (2009)[AID] 
Target
Name:
Regulator of G-protein signaling 19
Synonyms:
G protein signalling regulator 19 GNAI3IP RGS19_HUMAN | Regulator of G-protein signaling 19 (RGS19)
Type:
Enzyme Catalytic Domain
Mol. Mass.:
24631.38
Organism:
Homo sapiens (Human)
Description:
gi_86990435
Residue:
217
  
Inhibitor
Name:
BDBM47699
Synonyms:
2-[[4-(2-oxolanylmethylamino)-2-quinazolinyl]amino]phenol;hydrochloride 2-[[4-(tetrahydrofurfurylamino)quinazolin-2-yl]amino]phenol;hydrochloride MLS000026785 cid_6602541
Type:
Small organic molecule
Emp. Form.:
C19H20N4O2
Mol. Mass.:
336.3877
SMILES:
Oc1ccccc1Nc1nc(NCC2CCCO2)c2ccccc2n1
: