Target
Regulator of G-protein signaling 19
Ligand
BDBM47795
Substrate
Meas. Tech.
Dose response, multiplexed high-throughput screen for small molecule regulators of RGS family protein interactions, specifically RGS19-Galphao.
EC50
>30000±n/a nM
Citation
 PubChem, PC Dose response, multiplexed high-throughput screen for small molecule regulators of RGS family protein interactions, specifically RGS19-Galphao. PubChem Bioassay (2009)[AID] 
Target
Name:
Regulator of G-protein signaling 19
Synonyms:
G protein signalling regulator 19 GNAI3IP RGS19_HUMAN | Regulator of G-protein signaling 19 (RGS19)
Type:
Enzyme Catalytic Domain
Mol. Mass.:
24631.38
Organism:
Homo sapiens (Human)
Description:
gi_86990435
Residue:
217
  
Inhibitor
Name:
BDBM47795
Synonyms:
MLS000686223 N-[2-(2-methoxyphenyl)ethyl]-2-[(6-pyridin-3-yl-[1,2,4]triazolo[4,3-b]pyridazin-3-yl)sulfanyl]ethanamide N-[2-(2-methoxyphenyl)ethyl]-2-[[6-(3-pyridyl)-[1,2,4]triazolo[4,3-b]pyridazin-3-yl]thio]acetamide cid_16194780
Type:
Small organic molecule
Emp. Form.:
C21H20N6O2S
Mol. Mass.:
420.487
SMILES:
COc1ccccc1CCNC(=O)CSc1nnc2ccc(nn12)-c1cccnc1
: