Target
Regulator of G-protein signaling 19
Ligand
BDBM47796
Substrate
Meas. Tech.
Dose response, multiplexed high-throughput screen for small molecule regulators of RGS family protein interactions, specifically RGS19-Galphao.
EC50
>30000±n/a nM
Citation
 PubChem, PC Dose response, multiplexed high-throughput screen for small molecule regulators of RGS family protein interactions, specifically RGS19-Galphao. PubChem Bioassay (2009)[AID] 
Target
Name:
Regulator of G-protein signaling 19
Synonyms:
G protein signalling regulator 19 GNAI3IP RGS19_HUMAN | Regulator of G-protein signaling 19 (RGS19)
Type:
Enzyme Catalytic Domain
Mol. Mass.:
24631.38
Organism:
Homo sapiens (Human)
Description:
gi_86990435
Residue:
217
  
Inhibitor
Name:
BDBM47796
Synonyms:
(E)-1-(3,5-dimethyl-1-piperidinyl)-3-(5-nitro-2-thiophenyl)-2-propen-1-one (E)-1-(3,5-dimethylpiperidino)-3-(5-nitro-2-thienyl)prop-2-en-1-one SMR000322939 | cid_6012169
Type:
Small organic molecule
Emp. Form.:
C14H18N2O3S
Mol. Mass.:
294.369
SMILES:
CC1CC(C)CN(C1)C(=O)\C=C\c1ccc(s1)[N+]([O-])=O
: