Target
Regulator of G-protein signaling 19
Ligand
BDBM47807
Substrate
Meas. Tech.
Dose response, multiplexed high-throughput screen for small molecule regulators of RGS family protein interactions, specifically RGS19-Galphao.
EC50
>30000±n/a nM
Citation
 PubChem, PC Dose response, multiplexed high-throughput screen for small molecule regulators of RGS family protein interactions, specifically RGS19-Galphao. PubChem Bioassay (2009)[AID] 
Target
Name:
Regulator of G-protein signaling 19
Synonyms:
G protein signalling regulator 19 GNAI3IP RGS19_HUMAN | Regulator of G-protein signaling 19 (RGS19)
Type:
Enzyme Catalytic Domain
Mol. Mass.:
24631.38
Organism:
Homo sapiens (Human)
Description:
gi_86990435
Residue:
217
  
Inhibitor
Name:
BDBM47807
Synonyms:
(2S)-2-[[5-[[(1R)-1-phenylethyl]carbamoyl]-1H-imidazole-4-carbonyl]amino]propionic acid tert-butyl ester MLS000834661 cid_16196412 tert-butyl (2S)-2-[[5-[[(1R)-1-phenylethyl]carbamoyl]-1H-imidazole-4-carbonyl]amino]propanoate
Type:
Small organic molecule
Emp. Form.:
C20H26N4O4
Mol. Mass.:
386.4448
SMILES:
C[C@H](NC(=O)c1nc[nH]c1C(=O)N[C@H](C)c1ccccc1)C(=O)OC(C)(C)C
: