Target
Regulator of G-protein signaling 16
Ligand
BDBM47704
Substrate
Meas. Tech.
Dose respone, multiplexed high-throughput screen for small molecule regulators of RGS family protein interactions, specifically RGS16-Galphao.
EC50
>30000±n/a nM
Citation
 PubChem, PC Dose respone, multiplexed high-throughput screen for small molecule regulators of RGS family protein interactions, specifically RGS16-Galphao. PubChem Bioassay (2009)[AID] 
Target
Name:
Regulator of G-protein signaling 16
Synonyms:
RGS16 RGSR regulator of G-protein signalling 16
Type:
Enzyme Catalytic Domain
Mol. Mass.:
22748.87
Organism:
Homo sapiens (Human)
Description:
gi_156416009
Residue:
202
  
Inhibitor
Name:
BDBM47704
Synonyms:
2-[[3-(2,3-dihydro-1,4-benzodioxin-3-ylmethyl)-4-keto-quinazolin-2-yl]thio]acetic acid ethyl ester MLS000095253 cid_3240424 ethyl 2-[3-(2,3-dihydro-1,4-benzodioxin-3-ylmethyl)-4-oxoquinazolin-2-yl]sulfanylacetate | ethyl {[3-(2,3-dihydro-1,4-benzodioxin-2-ylmethyl)-4-oxo-3,4-dihydroquinazolin-2-yl]thio}acetate
Type:
Small organic molecule
Emp. Form.:
C21H20N2O5S
Mol. Mass.:
412.459
SMILES:
CCOC(=O)CSc1nc2ccccc2c(=O)n1CC1COc2ccccc2O1
: