Target
Regulator of G-protein signaling 16
Ligand
BDBM47760
Substrate
Meas. Tech.
Dose respone, multiplexed high-throughput screen for small molecule regulators of RGS family protein interactions, specifically RGS16-Galphao.
EC50
>30000±n/a nM
Citation
 PubChem, PC Dose respone, multiplexed high-throughput screen for small molecule regulators of RGS family protein interactions, specifically RGS16-Galphao. PubChem Bioassay (2009)[AID] 
Target
Name:
Regulator of G-protein signaling 16
Synonyms:
RGS16 RGSR regulator of G-protein signalling 16
Type:
Enzyme Catalytic Domain
Mol. Mass.:
22748.87
Organism:
Homo sapiens (Human)
Description:
gi_156416009
Residue:
202
  
Inhibitor
Name:
BDBM47760
Synonyms:
2-[[4-(4-tert-butylphenyl)-3-carbomethoxy-2-thienyl]carbamoyl]-7-oxabicyclo[2.2.1]heptane-3-carboxylic acid 2-[[4-(4-tert-butylphenyl)-3-methoxycarbonylthiophen-2-yl]carbamoyl]-7-oxabicyclo[2.2.1]heptane-3-carboxylic acid 3-({[4-(4-tert-butylphenyl)-3-(methoxycarbonyl)-2-thienyl]amino}carbonyl)-7-oxabicyclo[2.2.1]heptane-2-carboxylic acid SMR000231224 | cid_3565190
Type:
Small organic molecule
Emp. Form.:
C24H27NO6S
Mol. Mass.:
457.539
SMILES:
[H]C12CCC([H])(O1)C(C2C(O)=O)C(=O)Nc1scc(c1C(=O)OC)-c1ccc(cc1)C(C)(C)C
: