Target
Regulator of G-protein signaling 16
Ligand
BDBM47771
Substrate
Meas. Tech.
Dose respone, multiplexed high-throughput screen for small molecule regulators of RGS family protein interactions, specifically RGS16-Galphao.
EC50
>30000±n/a nM
Citation
 PubChem, PC Dose respone, multiplexed high-throughput screen for small molecule regulators of RGS family protein interactions, specifically RGS16-Galphao. PubChem Bioassay (2009)[AID] 
Target
Name:
Regulator of G-protein signaling 16
Synonyms:
RGS16 RGSR regulator of G-protein signalling 16
Type:
Enzyme Catalytic Domain
Mol. Mass.:
22748.87
Organism:
Homo sapiens (Human)
Description:
gi_156416009
Residue:
202
  
Inhibitor
Name:
BDBM47771
Synonyms:
2-[(2-methylsulfanylphenyl)carbamoyl]bicyclo[2.2.1]heptane-3-carboxylic acid 3-({[2-(methylthio)phenyl]amino}carbonyl)bicyclo[2.2.1]heptane-2-carboxylic acid MLS000663283 cid_4671471
Type:
Small organic molecule
Emp. Form.:
C16H19NO3S
Mol. Mass.:
305.392
SMILES:
[H]C12CCC([H])(C1)C(C2C(O)=O)C(=O)Nc1ccccc1SC
: