Target
Regulator of G-protein signaling 16
Ligand
BDBM47784
Substrate
Meas. Tech.
Dose respone, multiplexed high-throughput screen for small molecule regulators of RGS family protein interactions, specifically RGS16-Galphao.
EC50
>30000±n/a nM
Citation
 PubChem, PC Dose respone, multiplexed high-throughput screen for small molecule regulators of RGS family protein interactions, specifically RGS16-Galphao. PubChem Bioassay (2009)[AID] 
Target
Name:
Regulator of G-protein signaling 16
Synonyms:
RGS16 RGSR regulator of G-protein signalling 16
Type:
Enzyme Catalytic Domain
Mol. Mass.:
22748.87
Organism:
Homo sapiens (Human)
Description:
gi_156416009
Residue:
202
  
Inhibitor
Name:
BDBM47784
Synonyms:
2-[[(2-acetamido-5-bromo-phenyl)-phenyl-methyl]amino]acetic acid methyl ester MLS000692775 cid_2870391 methyl 2-[[(2-acetamido-5-bromophenyl)-phenylmethyl]amino]acetate
Type:
Small organic molecule
Emp. Form.:
C18H19BrN2O3
Mol. Mass.:
391.259
SMILES:
COC(=O)CNC(c1ccccc1)c1cc(Br)ccc1NC(C)=O
: