Target
Regulator of G-protein signaling 16
Ligand
BDBM47792
Substrate
Meas. Tech.
Dose respone, multiplexed high-throughput screen for small molecule regulators of RGS family protein interactions, specifically RGS16-Galphao.
EC50
880±n/a nM
Citation
 PubChem, PC Dose respone, multiplexed high-throughput screen for small molecule regulators of RGS family protein interactions, specifically RGS16-Galphao. PubChem Bioassay (2009)[AID] 
Target
Name:
Regulator of G-protein signaling 16
Synonyms:
RGS16 RGSR regulator of G-protein signalling 16
Type:
Enzyme Catalytic Domain
Mol. Mass.:
22748.87
Organism:
Homo sapiens (Human)
Description:
gi_156416009
Residue:
202
  
Inhibitor
Name:
BDBM47792
Synonyms:
MLS000689390 N-(2-chloro-4-methyl-phenyl)-2-(3-keto-4,6-dimethyl-isothiazolo[5,4-b]pyridin-2-yl)acetamide N-(2-chloro-4-methylphenyl)-2-(4,6-dimethyl-3-oxo-[1,2]thiazolo[5,4-b]pyridin-2-yl)acetamide SMR000311189 | cid_4247466
Type:
Small organic molecule
Emp. Form.:
C17H16ClN3O2S
Mol. Mass.:
361.846
SMILES:
Cc1ccc(NC(=O)Cn2sc3nc(C)cc(C)c3c2=O)c(Cl)c1
: