Target
Regulator of G-protein signaling 16
Ligand
BDBM47833
Substrate
Meas. Tech.
Dose respone, multiplexed high-throughput screen for small molecule regulators of RGS family protein interactions, specifically RGS16-Galphao.
EC50
>30000±n/a nM
Citation
 PubChem, PC Dose respone, multiplexed high-throughput screen for small molecule regulators of RGS family protein interactions, specifically RGS16-Galphao. PubChem Bioassay (2009)[AID] 
Target
Name:
Regulator of G-protein signaling 16
Synonyms:
RGS16 RGSR regulator of G-protein signalling 16
Type:
Enzyme Catalytic Domain
Mol. Mass.:
22748.87
Organism:
Homo sapiens (Human)
Description:
gi_156416009
Residue:
202
  
Inhibitor
Name:
BDBM47833
Synonyms:
2-[2-(hydroxymethyl)phenyl]sulfanyl-N-methyl-benzamide 2-[[2-(hydroxymethyl)phenyl]thio]-N-methylbenzamide N-methyl-2-[(2-methylolphenyl)thio]benzamide SMR000459784 | cid_2824943
Type:
Small organic molecule
Emp. Form.:
C15H15NO2S
Mol. Mass.:
273.35
SMILES:
CNC(=O)c1ccccc1Sc1ccccc1CO
: