Target
Alkaline phosphatase, tissue-nonspecific isozyme
Ligand
BDBM50299537
Substrate
Meas. Tech.
SAR assay for compounds inhibiting TNAP in the absence of phosphate acceptor performed in a luminescent assay
IC50
16600±n/a nM
Citation
 PubChem, PC SAR assay for compounds inhibiting TNAP in the absence of phosphate acceptor performed in a luminescent assay PubChem Bioassay (2010)[AID] 
Target
Name:
Alkaline phosphatase, tissue-nonspecific isozyme
Synonyms:
ALPL tissue-nonspecific alkaline phosphatase precursor
Type:
PROTEIN
Mol. Mass.:
57306.17
Organism:
Homo sapiens (Human)
Description:
ChEMBL_1448917
Residue:
524
  
Inhibitor
Name:
BDBM50299537
Synonyms:
2-Methoxy-5-methyl-N-(pyridin-3-yl)benzenesulfonamide cid_645853
Type:
Small organic molecule
Emp. Form.:
C13H14N2O3S
Mol. Mass.:
278.327
SMILES:
COc1ccc(C)cc1S(=O)(=O)Nc1cccnc1
: