Target
Dual specificity protein phosphatase 3
Ligand
BDBM46226
Substrate
Meas. Tech.
SAR VHR1 absorbance Assay for In Vitro dose response studies.
IC50
1290±n/a nM
Citation
 PubChem, PC SAR VHR1 absorbance Assay for In Vitro dose response studies. PubChem Bioassay (2009)[AID] 
Target
Name:
Dual specificity protein phosphatase 3
Synonyms:
DUS3_HUMAN Dual specificity protein phosphatase (VHR) Dual specificity protein phosphatase VHR Tyrosine-protein phosphatase non-receptor type 1 | VHR
Type:
Hydrolase
Mol. Mass.:
20480.58
Organism:
Homo sapiens (Human)
Description:
Residue:
185
  
Inhibitor
Name:
BDBM46226
Synonyms:
MLS-0266887.0001 | cid_2545524
Type:
Small organic molecule
Emp. Form.:
C25H22N2O8S2
Mol. Mass.:
542.581
SMILES:
CCOC(=O)c1sc2nc3c(SCCC(O)=O)cc(cn3c(=O)c2c1C)C(=O)c1cc(OC)ccc1O
: