Target
Beta-galactosidase
Ligand
BDBM48086
Substrate
Meas. Tech.
HTS Dose response counterscreen for assays utilizing the enzyme, b-galactosidase
EC50
8915±n/a nM
Citation
 PubChem, PC HTS Dose response counterscreen for assays utilizing the enzyme, b-galactosidase PubChem Bioassay (2009)[AID] 
Target
Name:
Beta-galactosidase
Synonyms:
BGAL_ECOLX Lactase | lacZ
Type:
PROTEIN
Mol. Mass.:
116943.87
Organism:
Escherichia coli
Description:
ChEMBL_215882
Residue:
1029
  
Inhibitor
Name:
BDBM48086
Synonyms:
6,7-dimethoxy-1-(3-nitrophenyl)spiro[2,3-dihydro-1H-isoquinoline-4,1'-cyclopentane] SMR000280032 | cid_2836255
Type:
Small organic molecule
Emp. Form.:
C21H24N2O4
Mol. Mass.:
368.4263
SMILES:
COc1cc2C(NCC3(CCCC3)c2cc1OC)c1cccc(c1)[N+]([O-])=O
: