Target
Beta-galactosidase
Ligand
BDBM48104
Substrate
Meas. Tech.
HTS Dose response counterscreen for assays utilizing the enzyme, b-galactosidase
EC50
11500±n/a nM
Citation
 PubChem, PC HTS Dose response counterscreen for assays utilizing the enzyme, b-galactosidase PubChem Bioassay (2009)[AID] 
Target
Name:
Beta-galactosidase
Synonyms:
BGAL_ECOLX Lactase | lacZ
Type:
PROTEIN
Mol. Mass.:
116943.87
Organism:
Escherichia coli
Description:
ChEMBL_215882
Residue:
1029
  
Inhibitor
Name:
BDBM48104
Synonyms:
3-(1-benzyl-2,6-diketo-7H-purin-3-yl)-4-methyl-benzoic acid methyl ester MLS001182025 cid_2823215 methyl 3-[2,6-bis(oxidanylidene)-1-(phenylmethyl)-7H-purin-3-yl]-4-methyl-benzoate
Type:
Small organic molecule
Emp. Form.:
C21H18N4O4
Mol. Mass.:
390.392
SMILES:
COC(=O)c1ccc(C)c(c1)-n1c2nc[nH]c2c(=O)n(Cc2ccccc2)c1=O
: