Target
Matrix metalloproteinase-14 [1-36]
Ligand
BDBM48229
Substrate
Meas. Tech.
Luminescent HTS for small molecule inhibitors of MT1-MMP transcription
EC50
4050±n/a nM
Citation
 PubChem, PC Luminescent HTS for small molecule inhibitors of MT1-MMP transcription PubChem Bioassay (2008)[AID] 
Target
Name:
Matrix metalloproteinase-14 [1-36]
Synonyms:
MMP14 matrix metalloproteinase 1
Type:
Enzyme Catalytic Domain
Mol. Mass.:
3658.23
Organism:
Homo sapiens (Human)
Description:
gi_6690534
Residue:
36
  
Inhibitor
Name:
BDBM48229
Synonyms:
2-phenyl-6,7-dihydropyrrolo[1,2-a]thieno[3,2-d]pyrimidin-9(5H)-one SMR000114489 | cid_900065
Type:
Small organic molecule
Emp. Form.:
C15H12N2OS
Mol. Mass.:
268.334
SMILES:
O=c1n2CCCc2nc2cc(sc12)-c1ccccc1
: