Target
Eukaryotic translation initiation factor 4 gamma 1
Ligand
BDBM44482
Substrate
Meas. Tech.
Dose Response Confirmation for Small Molecule Inhibitors of Eukaryotic Translation Initiation
IC50
11341.56611±n/a nM
Citation
 PubChem, PC Dose Response Confirmation for Small Molecule Inhibitors of Eukaryotic Translation Initiation PubChem Bioassay (2009)[AID] 
Target
Name:
Eukaryotic translation initiation factor 4 gamma 1
Synonyms:
EIF4F EIF4G1 IF4G1_HUMAN | eukaryotic translation initiation factor 4 gamma, 1 isoform 4
Type:
Enzyme Catalytic Domain
Mol. Mass.:
175455.17
Organism:
Homo sapiens (Human)
Description:
Q04637
Residue:
1599
  
Inhibitor
Name:
BDBM44482
Synonyms:
2-[(5Z)-5-[(E)-3-(2-furanyl)prop-2-enylidene]-4-oxo-2-sulfanylidene-3-thiazolidinyl]-3-methylbutanoic acid 2-[(5Z)-5-[(E)-3-(furan-2-yl)prop-2-enylidene]-4-oxidanylidene-2-sulfanylidene-1,3-thiazolidin-3-yl]-3-methyl-butanoic acid 2-{5-[(E)-3-Furan-2-yl-prop-2-en-(Z)-ylidene]-4-oxo-2-thioxo-thiazolidin-3-yl}-3-methyl-butyric acid SMR000145597 | cid_6393068
Type:
Small organic molecule
Emp. Form.:
C15H15NO4S2
Mol. Mass.:
337.414
SMILES:
CC(C)C(N1C(=S)S\C(=C/C=C/c2ccco2)C1=O)C(O)=O
: