Target
Eukaryotic translation initiation factor 4 gamma 1
Ligand
BDBM48878
Substrate
Meas. Tech.
Dose Response Confirmation for Small Molecule Inhibitors of Eukaryotic Translation Initiation
IC50
9860±n/a nM
Citation
 PubChem, PC Dose Response Confirmation for Small Molecule Inhibitors of Eukaryotic Translation Initiation PubChem Bioassay (2009)[AID] 
Target
Name:
Eukaryotic translation initiation factor 4 gamma 1
Synonyms:
EIF4F EIF4G1 IF4G1_HUMAN | eukaryotic translation initiation factor 4 gamma, 1 isoform 4
Type:
Enzyme Catalytic Domain
Mol. Mass.:
175455.17
Organism:
Homo sapiens (Human)
Description:
Q04637
Residue:
1599
  
Inhibitor
Name:
BDBM48878
Synonyms:
4-((3E)-3-{[5-(4-nitrophenyl)-2-furyl]methylene}-2-oxo-5-phenyl-2,3-dihydro-1H-pyrrol-1-yl)benzoic acid 4-[(3E)-3-[[5-(4-nitrophenyl)-2-furanyl]methylidene]-2-oxo-5-phenyl-1-pyrrolyl]benzoic acid 4-[(3E)-3-[[5-(4-nitrophenyl)furan-2-yl]methylidene]-2-oxo-5-phenylpyrrol-1-yl]benzoic acid SMR000312561 | cid_16195554
Type:
Small organic molecule
Emp. Form.:
C28H18N2O6
Mol. Mass.:
478.4523
SMILES:
OC(=O)c1ccc(cc1)N1C(=O)\C(=C\c2ccc(o2)-c2ccc(cc2)[N+]([O-])=O)C=C1c1ccccc1
: