Target
Eukaryotic translation initiation factor 4 gamma 1
Ligand
BDBM33201
Substrate
Meas. Tech.
Dose Response Confirmation for Small Molecule Inhibitors of Eukaryotic Translation Initiation
IC50
10270±n/a nM
Citation
 PubChem, PC Dose Response Confirmation for Small Molecule Inhibitors of Eukaryotic Translation Initiation PubChem Bioassay (2009)[AID] 
Target
Name:
Eukaryotic translation initiation factor 4 gamma 1
Synonyms:
EIF4F EIF4G1 IF4G1_HUMAN | eukaryotic translation initiation factor 4 gamma, 1 isoform 4
Type:
Enzyme Catalytic Domain
Mol. Mass.:
175455.17
Organism:
Homo sapiens (Human)
Description:
Q04637
Residue:
1599
  
Inhibitor
Name:
BDBM33201
Synonyms:
2-methyl-5,8-bis(oxidanyl)naphthalene-1,4-dione 5,8-dihydroxy-2-methylnaphthalene-1,4-dione SMR000387073 | cid_271296
Type:
Small organic molecule
Emp. Form.:
C11H8O4
Mol. Mass.:
204.1788
SMILES:
CC1=CC(=O)c2c(O)ccc(O)c2C1=O
: