Target
D(1B) dopamine receptor
Ligand
BDBM48909
Substrate
Meas. Tech.
Allosteric Modulators of D1 Receptors: Dose-dependent Counterscreen
EC50
0.0068±n/a nM
Citation
 PubChem, PC Allosteric Modulators of D1 Receptors: Dose-dependent Counterscreen PubChem Bioassay (2007)[AID] 
Target
Name:
D(1B) dopamine receptor
Synonyms:
D(5) dopamine receptor DOPAMINE D5 DRD1L2 DRD5_HUMAN | dopamine receptor D5
Type:
Protein
Mol. Mass.:
52943.41
Organism:
Homo sapiens (Human)
Description:
P21918
Residue:
477
  
Inhibitor
Name:
BDBM48909
Synonyms:
2-[5-(4-Fluoro-phenyl)-thiazolo[2,3-c][1,2,4]triazol-3-ylsulfanyl]-N-furan-2-ylmethyl-acetamide 2-[[5-(4-fluorophenyl)-[1,3]thiazolo[2,3-c][1,2,4]triazol-3-yl]sulfanyl]-N-(furan-2-ylmethyl)acetamide 2-[[5-(4-fluorophenyl)thiazolo[2,3-c][1,2,4]triazol-3-yl]thio]-N-(2-furfuryl)acetamide SMR000007125 | cid_649740
Type:
Small organic molecule
Emp. Form.:
C17H13FN4O2S2
Mol. Mass.:
388.439
SMILES:
Fc1ccc(cc1)-c1csc2nnc(SCC(=O)NCc3ccco3)n12
: